2019-08-01

node-sass 安装失败解决方案

  1. Mac 环境下:
    一般安装失败都是npm 翻墙失败导致,用淘宝镜像就可以解决。
    先安装cnpm - 淘宝镜像
npm install -g cnpm --registry=https://registry.npm.taobao.org

然后在使用 cnpm 安装node-sass

cnpm i node-sass

如果你安装的node-sass还是失败,检查你的node版本号,安装对应的node-sass版本
下方是node版本对应要求的node-sass版本


image.png

2.window 环境下:
建议安装node_modules 时node-sass 先安装,完成后再安装别的模块
如果遇到以下报错

> node-sass@4.7.2 install D:\hj-program\mcstatic\node_modules\node-sass
> node scripts/install.js

Downloading binary from https://github.com/sass/node-sass/releases/download/v4.7.2/win32-x64-64_binding.node
Cannot download "https://github.com/sass/node-sass/releases/download/v4.7.2/win32-x64-64_binding.node":

HTTP error 404 Not Found

Hint: If github.com is not accessible in your location
      try setting a proxy via HTTP_PROXY, e.g.

      export HTTP_PROXY=http://example.com:1234

or configure npm proxy via

      npm config set proxy http://example.com:8080

> node-sass@4.7.2 postinstall D:\hj-program\mcstatic\node_modules\node-sass
> node scripts/build.js

Building: C:\Program Files\nodejs\node.exe D:\hj-program\mcstatic\node_modules\node-gyp\bin\node-gyp.js rebuild --verbose --libsass_ext= --libsass_cflags= --libsass_ldflags= --libsass_library=
gyp info it worked if it ends with ok
gyp verb cli [ 'C:\\Program Files\\nodejs\\node.exe',
gyp verb cli   'D:\\hj-program\\mcstatic\\node_modules\\node-gyp\\bin\\node-gyp.js',
gyp verb cli   'rebuild',
gyp verb cli   '--verbose',
gyp verb cli   '--libsass_ext=',
gyp verb cli   '--libsass_cflags=',
gyp verb cli   '--libsass_ldflags=',
gyp verb cli   '--libsass_library=' ]
gyp info using node-gyp@3.8.0
gyp info using node@10.16.0 | win32 | x64
gyp verb command rebuild []
gyp verb command clean []
gyp verb clean removing "build" directory
gyp verb command configure []
gyp verb check python checking for Python executable "python2" in the PATH
gyp verb `which` failed Error: not found: python2
gyp verb `which` failed     at getNotFoundError (D:\hj-program\mcstatic\node_modules\which\which.js:13:12)
gyp verb `which` failed     at F (D:\hj-program\mcstatic\node_modules\which\which.js:68:19)
gyp verb `which` failed     at E (D:\hj-program\mcstatic\node_modules\which\which.js:80:29)
gyp verb `which` failed     at D:\hj-program\mcstatic\node_modules\which\which.js:89:16
gyp verb `which` failed     at D:\hj-program\mcstatic\node_modules\isexe\index.js:42:5
gyp verb `which` failed     at D:\hj-program\mcstatic\node_modules\isexe\windows.js:36:5
gyp verb `which` failed     at FSReqWrap.oncomplete (fs.js:153:21)
gyp verb `which` failed  python2 { Error: not found: python2
gyp verb `which` failed     at getNotFoundError (D:\hj-program\mcstatic\node_modules\which\which.js:13:12)
gyp verb `which` failed     at F (D:\hj-program\mcstatic\node_modules\which\which.js:68:19)
gyp verb `which` failed     at E (D:\hj-program\mcstatic\node_modules\which\which.js:80:29)
gyp verb `which` failed     at D:\hj-program\mcstatic\node_modules\which\which.js:89:16
gyp verb `which` failed     at D:\hj-program\mcstatic\node_modules\isexe\index.js:42:5
gyp verb `which` failed     at D:\hj-program\mcstatic\node_modules\isexe\windows.js:36:5
gyp verb `which` failed     at FSReqWrap.oncomplete (fs.js:153:21)
gyp verb `which` failed   stack:
gyp verb `which` failed    'Error: not found: python2\n    at getNotFoundError (D:\\hj-program\\mcstatic\\node_modules\\which\\which.js:13:12)\n    at F (D:\\hj-program\\mcstatic\\node_modules\\which\\which.js:68:19)\n    at E (D:\\hj-program\\mcstatic\\node_modules\\which\\which.js:80:29)\n    at D:\\hj-program\\mcstatic\\node_modules\\which\\which.js:89:16\n    at D:\\hj-program\\mcstatic\\node_modules\\isexe\\index.js:42:5\n    at D:\\hj-program\\mcstatic\\node_modules\\isexe\\windows.js:36:5\n    at FSReqWrap.oncomplete (fs.js:153:21)',
gyp verb `which` failed   code: 'ENOENT' }
gyp verb check python checking for Python executable "python" in the PATH
gyp verb `which` failed Error: not found: python
gyp verb `which` failed     at getNotFoundError (D:\hj-program\mcstatic\node_modules\which\which.js:13:12)
gyp verb `which` failed     at F (D:\hj-program\mcstatic\node_modules\which\which.js:68:19)
gyp verb `which` failed     at E (D:\hj-program\mcstatic\node_modules\which\which.js:80:29)
gyp verb `which` failed     at D:\hj-program\mcstatic\node_modules\which\which.js:89:16
gyp verb `which` failed     at D:\hj-program\mcstatic\node_modules\isexe\index.js:42:5
gyp verb `which` failed     at D:\hj-program\mcstatic\node_modules\isexe\windows.js:36:5
gyp verb `which` failed     at FSReqWrap.oncomplete (fs.js:153:21)
gyp verb `which` failed  python { Error: not found: python
gyp verb `which` failed     at getNotFoundError (D:\hj-program\mcstatic\node_modules\which\which.js:13:12)
gyp verb `which` failed     at F (D:\hj-program\mcstatic\node_modules\which\which.js:68:19)
gyp verb `which` failed     at E (D:\hj-program\mcstatic\node_modules\which\which.js:80:29)
gyp verb `which` failed     at D:\hj-program\mcstatic\node_modules\which\which.js:89:16
gyp verb `which` failed     at D:\hj-program\mcstatic\node_modules\isexe\index.js:42:5
gyp verb `which` failed     at D:\hj-program\mcstatic\node_modules\isexe\windows.js:36:5
gyp verb `which` failed     at FSReqWrap.oncomplete (fs.js:153:21)
gyp verb `which` failed   stack:
gyp verb `which` failed    'Error: not found: python\n    at getNotFoundError (D:\\hj-program\\mcstatic\\node_modules\\which\\which.js:13:12)\n    at F (D:\\hj-program\\mcstatic\\node_modules\\which\\which.js:68:19)\n    at E (D:\\hj-program\\mcstatic\\node_modules\\which\\which.js:80:29)\n    at D:\\hj-program\\mcstatic\\node_modules\\which\\which.js:89:16\n    at D:\\hj-program\\mcstatic\\node_modules\\isexe\\index.js:42:5\n    at D:\\hj-program\\mcstatic\\node_modules\\isexe\\windows.js:36:5\n    at FSReqWrap.oncomplete (fs.js:153:21)',
gyp verb `which` failed   code: 'ENOENT' }
gyp verb could not find "python". checking python launcher
gyp verb could not find "python". guessing location
gyp verb ensuring that file exists: C:\Python27\python.exe
gyp ERR! configure error
gyp ERR! stack Error: Can't find Python executable "python", you can set the PYTHON env variable.
gyp ERR! stack     at PythonFinder.failNoPython (D:\hj-program\mcstatic\node_modules\node-gyp\lib\configure.js:484:19)
gyp ERR! stack     at PythonFinder.<anonymous> (D:\hj-program\mcstatic\node_modules\node-gyp\lib\configure.js:509:16)
gyp ERR! stack     at callback (D:\hj-program\mcstatic\node_modules\graceful-fs\polyfills.js:289:20)
gyp ERR! stack     at FSReqWrap.oncomplete (fs.js:153:21)
gyp ERR! System Windows_NT 10.0.17763
gyp ERR! command "C:\\Program Files\\nodejs\\node.exe" "D:\\hj-program\\mcstatic\\node_modules\\node-gyp\\bin\\node-gyp.js" "rebuild" "--verbose" "--libsass_ext=" "--libsass_cflags=" "--libsass_ldflags=" "--libsass_library="
gyp ERR! cwd D:\hj-program\mcstatic\node_modules\node-sass
gyp ERR! node -v v10.16.0
gyp ERR! node-gyp -v v3.8.0
gyp ERR! not ok
Build failed with error code: 1
npm ERR! code ELIFECYCLE
npm ERR! errno 1
npm ERR! node-sass@4.7.2 postinstall: `node scripts/build.js`
npm ERR! Exit status 1
npm ERR!
npm ERR! Failed at the node-sass@4.7.2 postinstall script.
npm ERR! This is probably not a problem with npm. There is likely additional logging output above.

npm ERR! A complete log of this run can be found in:
npm ERR!     C:\Users\niyuanyuan01\AppData\Roaming\npm-cache\_logs\2019-08-01T03_33_39_918Z-debug.log

可能是window下缺少编译环境,全局安装下面模块

npm install -g node-gyp

安装之后还是发现出错,再安装window自己的构建工具
注:下面安装需要在window下powerShell 下以管理员权限执行

install --global --production windows-build-tools

安装完成之后,删除之前安装的 node_modules ,然后再在你的项目目录下执行

npm i node-sass
image.png

安装完成

最后编辑于
©著作权归作者所有,转载或内容合作请联系作者
  • 序言:七十年代末,一起剥皮案震惊了整个滨河市,随后出现的几起案子,更是在滨河造成了极大的恐慌,老刑警刘岩,带你破解...
    沈念sama阅读 224,242评论 6 522
  • 序言:滨河连续发生了三起死亡事件,死亡现场离奇诡异,居然都是意外死亡,警方通过查阅死者的电脑和手机,发现死者居然都...
    沈念sama阅读 95,953评论 3 402
  • 文/潘晓璐 我一进店门,熙熙楼的掌柜王于贵愁眉苦脸地迎上来,“玉大人,你说我怎么就摊上这事。” “怎么了?”我有些...
    开封第一讲书人阅读 171,299评论 0 366
  • 文/不坏的土叔 我叫张陵,是天一观的道长。 经常有香客问我,道长,这世上最难降的妖魔是什么? 我笑而不...
    开封第一讲书人阅读 60,709评论 1 300
  • 正文 为了忘掉前任,我火速办了婚礼,结果婚礼上,老公的妹妹穿的比我还像新娘。我一直安慰自己,他们只是感情好,可当我...
    茶点故事阅读 69,723评论 6 399
  • 文/花漫 我一把揭开白布。 她就那样静静地躺着,像睡着了一般。 火红的嫁衣衬着肌肤如雪。 梳的纹丝不乱的头发上,一...
    开封第一讲书人阅读 53,236评论 1 314
  • 那天,我揣着相机与录音,去河边找鬼。 笑死,一个胖子当着我的面吹牛,可吹牛的内容都是我干的。 我是一名探鬼主播,决...
    沈念sama阅读 41,629评论 3 428
  • 文/苍兰香墨 我猛地睁开眼,长吁一口气:“原来是场噩梦啊……” “哼!你这毒妇竟也来了?” 一声冷哼从身侧响起,我...
    开封第一讲书人阅读 40,594评论 0 279
  • 序言:老挝万荣一对情侣失踪,失踪者是张志新(化名)和其女友刘颖,没想到半个月后,有当地人在树林里发现了一具尸体,经...
    沈念sama阅读 47,135评论 1 324
  • 正文 独居荒郊野岭守林人离奇死亡,尸身上长有42处带血的脓包…… 初始之章·张勋 以下内容为张勋视角 年9月15日...
    茶点故事阅读 39,156评论 3 345
  • 正文 我和宋清朗相恋三年,在试婚纱的时候发现自己被绿了。 大学时的朋友给我发了我未婚夫和他白月光在一起吃饭的照片。...
    茶点故事阅读 41,285评论 1 354
  • 序言:一个原本活蹦乱跳的男人离奇死亡,死状恐怖,灵堂内的尸体忽然破棺而出,到底是诈尸还是另有隐情,我是刑警宁泽,带...
    沈念sama阅读 36,914评论 5 350
  • 正文 年R本政府宣布,位于F岛的核电站,受9级特大地震影响,放射性物质发生泄漏。R本人自食恶果不足惜,却给世界环境...
    茶点故事阅读 42,600评论 3 336
  • 文/蒙蒙 一、第九天 我趴在偏房一处隐蔽的房顶上张望。 院中可真热闹,春花似锦、人声如沸。这庄子的主人今日做“春日...
    开封第一讲书人阅读 33,073评论 0 25
  • 文/苍兰香墨 我抬头看了看天上的太阳。三九已至,却和暖如春,着一层夹袄步出监牢的瞬间,已是汗流浃背。 一阵脚步声响...
    开封第一讲书人阅读 34,203评论 1 275
  • 我被黑心中介骗来泰国打工, 没想到刚下飞机就差点儿被人妖公主榨干…… 1. 我叫王不留,地道东北人。 一个月前我还...
    沈念sama阅读 49,798评论 3 381
  • 正文 我出身青楼,却偏偏与公主长得像,于是被迫代替她去往敌国和亲。 传闻我的和亲对象是个残疾皇子,可洞房花烛夜当晚...
    茶点故事阅读 46,339评论 2 365

推荐阅读更多精彩内容

  • 猎豹移动开发基础流程 一、开发技能 二、mPaaS知识 三、H5工作内容 1. 业务开发 2. 离线包上架 3. ...
    杜府阅读 233评论 0 0
  • 淘宝近期确实严查刷单,今年淘宝抓刷单力度是前所未有 通...
    雨中的悲伤01阅读 157评论 0 0
  • 做好淘宝并不难!想让你的淘宝店铺在同行中出类拔萃?做好这几招流量翻倍 ...
    雨中的悲伤01阅读 107评论 0 0
  • 子曰:“如有周公之才之美,使骄且吝,其余不足观也已。” 子曰:“三年学,不至于谷,不易得也。” 子曰:“笃信好学,...
    李老师要思考阅读 176评论 0 1
  • 我家住在雷溪边, 端午沿岸寻艾蒿。 突见河边水流急, 仿佛与她诵离骚。
    黄晓红阅读 141评论 0 1