Python Pytest自动化测试框架 Assert 断言使用

Time will tell.

1、使用assert语句进行断言

Pytest 允许使用标准的 Python assert 语法,用来校验expectation and value是否一致。

代码:

def func():
    return 3

def test_func():
    assert func() == 4

结果:

(wda_python) bash-3.2$ pytest -q test_assert.py 
F                                                                                                                                  [100%]
================================================================ FAILURES ================================================================
_______________________________________________________________ test_func ________________________________________________________________

    def test_func():
>       assert func() == 4
E       assert 3 == 4
E        +  where 3 = func()

test_assert.py:5: AssertionError
1 failed in 0.07 seconds
(wda_python) bash-3.2$ 

支持在assert后面添加描述信息:

def func():
    return 3

def test_func():
    assert func() == 4, 'Value was odd, should be even'

结果:

(wda_python) bash-3.2$ pytest -q test_assert.py 
F                                                                                                                                  [100%]
================================================================ FAILURES ================================================================
_______________________________________________________________ test_func ________________________________________________________________

    def test_func():
>       assert func() == 4, 'Value was odd, should be even'
E       AssertionError: Value was odd, should be even
E       assert 3 == 4
E        +  where 3 = func()

test_assert.py:5: AssertionError
1 failed in 0.07 seconds
(wda_python) bash-3.2$ 

2、预期异常的断言

Pytest 中使用with pytest.raises来断言预期异常。

代码:

import pytest

def func():
    raise SystemExit(1)

def test_func():
    with pytest.raises(SystemExit):
        func()

输出:

(wda_python) bash-3.2$ pytest -q test_sysexit.py 
.                                                                                                                                      [100%]
1 passed in 0.04 seconds
(wda_python) bash-3.2$ 

还可自定义错误的描述:

import pytest

def func():
    raise SystemError("Exception 123 raised")

def test_func():
    with pytest.raises(SystemError, match=r'.* 123 .*'):
        func()

输出:

(wda_python) bash-3.2$ pytest -q test_assert.py 
.                                                                                                                                  [100%]
1 passed in 0.03 seconds
(wda_python) bash-3.2$ 

如果不匹配就会报错:

import pytest

def func():
    raise SystemError("Exception 124 raised")

def test_func():
    with pytest.raises(SystemError, match=r'.* 123 .*'):
        func()

输出:

(wda_python) bash-3.2$ pytest -q test_assert.py 
F                                                                                                                                  [100%]
================================================================ FAILURES ================================================================
_______________________________________________________________ test_func ________________________________________________________________

    def test_func():
        with pytest.raises(SystemError, match=r'.* 123 .*'):
>           func()
E           AssertionError: Pattern '.* 123 .*' not found in 'Exception 124 raised'

test_assert.py:8: AssertionError
1 failed in 0.07 seconds
(wda_python) bash-3.2$ 

断言上下文内容(变量)是否相等,实例代码:

def test_set_comparison():
    set1 = set('1308')
    set2 = set('8035')
    assert set1 == set2

结果:

(wda_python) bash-3.2$ pytest -q test_assert.py 
F                                                                                                                                  [100%]
================================================================ FAILURES ================================================================
__________________________________________________________ test_set_comparison ___________________________________________________________

    def test_set_comparison():
        set1 = set('1308')
        set2 = set('8035')
>       assert set1 == set2
E       AssertionError: assert set(['0', '1', '3', '8']) == set(['0', '3', '5', '8'])
E         Extra items in the left set:
E         '1'
E         Extra items in the right set:
E         '5'
E         Full diff:
E         - set(['0', '1', '3', '8'])
E         ?           -----...
E         
E         ...Full output truncated (3 lines hidden), use '-vv' to show

test_assert.py:4: AssertionError
1 failed in 0.10 seconds
(wda_python) bash-3.2$ 

3、自定义断言

可通过实现pytest_assertrepr_compare方法,来自定义assert实现。

比如一个Class Foo,我们比较 f1 和 f2 。

class Foo(object):
    def __init__(self, val):
        self.val = val

    def __eq__(self, other):
        return self.val == other.val

def test_compare():
    f1 = Foo(1)
    f2 = Foo(1)
    assert f1 == f2

结果:

(wda_python) bash-3.2$ pytest -q test_foocompare.py 
F                                                                                                                                  [100%]
================================================================ FAILURES ================================================================
______________________________________________________________ test_compare ______________________________________________________________

    def test_compare():
        f1 = Foo(1)
        f2 = Foo(2)
>       assert f1 == f2
E       assert <test_foocompare.Foo object at 0x1029eb7d0> == <test_foocompare.Foo object at 0x1029eb290>

test_foocompare.py:11: AssertionError
1 failed in 0.09 seconds
(wda_python) bash-3.2$ 

错误提示不够友好, 可以通过完成pytest_assertrepr_compare方法自定义:

from test_foocompare import Foo

def pytest_assertrepr_compare(op, left, right):
    if isinstance(left, Foo) and isinstance(right, Foo) and op == "==":
        return ['Comparing Foo instance:', 'vals: %s != %s' % (left.val, right.val)]

结果如下:

(wda_python) bash-3.2$ pytest
========================================================== test session starts ===========================================================
platform darwin -- Python 2.7.15, pytest-4.1.0, py-1.7.0, pluggy-0.8.0
rootdir: /Users/jackey/Documents/iOS/code/iOS-Auto/Agent_Test, inifile:
collected 1 item                                                                                                                         

test_foocompare.py F                                                                                                               [100%]

================================================================ FAILURES ================================================================
______________________________________________________________ test_compare ______________________________________________________________

    def test_compare():
        f1 = Foo(1)
        f2 = Foo(2)
>       assert f1 == f2
E       assert Comparing Foo instance:
E         vals: 1 != 2

test_foocompare.py:11: AssertionError
======================================================== 1 failed in 0.05 seconds ========================================================
(wda_python) bash-3.2$ 

以上关于断言分享就到这里,希望对看过本章节的你有所帮助,如果你喜欢软件测试这个行业,可以加入我们175317069一起学习,会有行业深潜多年的测试人技术分析讲解。

祝愿你能成为一名优秀的软件测试工程师!

欢迎【评论】、【点赞】、【关注】~

Time will tell.(时间会证明一切)

©著作权归作者所有,转载或内容合作请联系作者
  • 序言:七十年代末,一起剥皮案震惊了整个滨河市,随后出现的几起案子,更是在滨河造成了极大的恐慌,老刑警刘岩,带你破解...
    沈念sama阅读 219,589评论 6 508
  • 序言:滨河连续发生了三起死亡事件,死亡现场离奇诡异,居然都是意外死亡,警方通过查阅死者的电脑和手机,发现死者居然都...
    沈念sama阅读 93,615评论 3 396
  • 文/潘晓璐 我一进店门,熙熙楼的掌柜王于贵愁眉苦脸地迎上来,“玉大人,你说我怎么就摊上这事。” “怎么了?”我有些...
    开封第一讲书人阅读 165,933评论 0 356
  • 文/不坏的土叔 我叫张陵,是天一观的道长。 经常有香客问我,道长,这世上最难降的妖魔是什么? 我笑而不...
    开封第一讲书人阅读 58,976评论 1 295
  • 正文 为了忘掉前任,我火速办了婚礼,结果婚礼上,老公的妹妹穿的比我还像新娘。我一直安慰自己,他们只是感情好,可当我...
    茶点故事阅读 67,999评论 6 393
  • 文/花漫 我一把揭开白布。 她就那样静静地躺着,像睡着了一般。 火红的嫁衣衬着肌肤如雪。 梳的纹丝不乱的头发上,一...
    开封第一讲书人阅读 51,775评论 1 307
  • 那天,我揣着相机与录音,去河边找鬼。 笑死,一个胖子当着我的面吹牛,可吹牛的内容都是我干的。 我是一名探鬼主播,决...
    沈念sama阅读 40,474评论 3 420
  • 文/苍兰香墨 我猛地睁开眼,长吁一口气:“原来是场噩梦啊……” “哼!你这毒妇竟也来了?” 一声冷哼从身侧响起,我...
    开封第一讲书人阅读 39,359评论 0 276
  • 序言:老挝万荣一对情侣失踪,失踪者是张志新(化名)和其女友刘颖,没想到半个月后,有当地人在树林里发现了一具尸体,经...
    沈念sama阅读 45,854评论 1 317
  • 正文 独居荒郊野岭守林人离奇死亡,尸身上长有42处带血的脓包…… 初始之章·张勋 以下内容为张勋视角 年9月15日...
    茶点故事阅读 38,007评论 3 338
  • 正文 我和宋清朗相恋三年,在试婚纱的时候发现自己被绿了。 大学时的朋友给我发了我未婚夫和他白月光在一起吃饭的照片。...
    茶点故事阅读 40,146评论 1 351
  • 序言:一个原本活蹦乱跳的男人离奇死亡,死状恐怖,灵堂内的尸体忽然破棺而出,到底是诈尸还是另有隐情,我是刑警宁泽,带...
    沈念sama阅读 35,826评论 5 346
  • 正文 年R本政府宣布,位于F岛的核电站,受9级特大地震影响,放射性物质发生泄漏。R本人自食恶果不足惜,却给世界环境...
    茶点故事阅读 41,484评论 3 331
  • 文/蒙蒙 一、第九天 我趴在偏房一处隐蔽的房顶上张望。 院中可真热闹,春花似锦、人声如沸。这庄子的主人今日做“春日...
    开封第一讲书人阅读 32,029评论 0 22
  • 文/苍兰香墨 我抬头看了看天上的太阳。三九已至,却和暖如春,着一层夹袄步出监牢的瞬间,已是汗流浃背。 一阵脚步声响...
    开封第一讲书人阅读 33,153评论 1 272
  • 我被黑心中介骗来泰国打工, 没想到刚下飞机就差点儿被人妖公主榨干…… 1. 我叫王不留,地道东北人。 一个月前我还...
    沈念sama阅读 48,420评论 3 373
  • 正文 我出身青楼,却偏偏与公主长得像,于是被迫代替她去往敌国和亲。 传闻我的和亲对象是个残疾皇子,可洞房花烛夜当晚...
    茶点故事阅读 45,107评论 2 356

推荐阅读更多精彩内容